Error while trying to build with EAS

hey guys. i have this error while trying to build app android with EAS, pls help :frowning:

? expo-web-browser (10.0.3)
> Configure project :lottie-react-native
[stderr] 
Warning: Mapping new ns http://schemas.android.com/repository/android/common/02 to old ns http://schemas.android.com/repository/android/common/01
[stderr] 
Warning: Mapping new ns http://schemas.android.com/repository/android/generic/02 to old ns http://schemas.android.com/repository/android/generic/01
[stderr] 
Warning: Mapping new ns http://schemas.android.com/sdk/android/repo/addon2/02 to old ns http://schemas.android.com/sdk/android/repo/addon2/01
[stderr] 
Warning: Mapping new ns http://schemas.android.com/sdk/android/repo/repository2/02 to old ns http://schemas.android.com/sdk/android/repo/repository2/01
[stderr] 
Warning: Mapping new ns http://schemas.android.com/sdk/android/repo/sys-img2/02 to old ns http://schemas.android.com/sdk/android/repo/sys-img2/01
[stderr] 
Warning: Mapping new ns http://schemas.android.com/repository/android/common/02 to old ns http://schemas.android.com/repository/android/common/01
[stderr] 
Warning: Mapping new ns http://schemas.android.com/repository/android/generic/02 to old ns http://schemas.android.com/repository/android/generic/01
[stderr] 
Warning: Mapping new ns http://schemas.android.com/sdk/android/repo/addon2/02 to old ns http://schemas.android.com/sdk/android/repo/addon2/01
[stderr] 
Warning: Mapping new ns http://schemas.android.com/sdk/android/repo/repository2/02 to old ns http://schemas.android.com/sdk/android/repo/repository2/01
[stderr] 
Warning: Mapping new ns http://schemas.android.com/sdk/android/repo/sys-img2/02 to old ns http://schemas.android.com/sdk/android/repo/sys-img2/01
> Configure project :react-native-firebase_app
:react-native-firebase_app package.json found at /home/expo/workingdir/build/node_modules/@react-native-firebase/app/package.json
:react-native-firebase_app:firebase.bom using default value: 29.1.0
:react-native-firebase_app:play.play-services-auth using default value: 20.1.0
:react-native-firebase_app package.json found at /home/expo/workingdir/build/node_modules/@react-native-firebase/app/package.json
:react-native-firebase_app:version set from package.json: 14.5.0 (14,5,0 - 14005000)
:react-native-firebase_app:android.compileSdk using custom value: 30
:react-native-firebase_app:android.targetSdk using custom value: 30
:react-native-firebase_app:android.minSdk using custom value: 21
:react-native-firebase_app:reactNativeAndroidDir /home/expo/workingdir/build/node_modules/react-native/android
> Configure project :react-native-firebase_crashlytics
:react-native-firebase_crashlytics package.json found at /home/expo/workingdir/build/node_modules/@react-native-firebase/crashlytics/package.json
:react-native-firebase_app package.json found at /home/expo/workingdir/build/node_modules/@react-native-firebase/app/package.json
:react-native-firebase_crashlytics:firebase.bom using default value: 29.1.0
:react-native-firebase_crashlytics package.json found at /home/expo/workingdir/build/node_modules/@react-native-firebase/crashlytics/package.json
:react-native-firebase_crashlytics:version set from package.json: 14.5.0 (14,5,0 - 14005000)
:react-native-firebase_crashlytics:android.compileSdk using custom value: 30
:react-native-firebase_crashlytics:android.targetSdk using custom value: 30
:react-native-firebase_crashlytics:android.minSdk using custom value: 21
:react-native-firebase_crashlytics:reactNativeAndroidDir /home/expo/workingdir/build/node_modules/react-native/android
> Task :app:bundleReleaseJsAndAssets
warning: the transform cache was reset.
Welcome to Metro!
Fast - Scalable - Integrated
[stderr] 
error index.js: Transformer.transform is not a function.
TypeError: Transformer.transform is not a function
    at Object.<anonymous> (/home/expo/workingdir/build/node_modules/@react-native-community/cli/node_modules/metro/src/DeltaBundler/Worker.js:80:38)
    at Generator.next (<anonymous>)
    at asyncGeneratorStep (/home/expo/workingdir/build/node_modules/@react-native-community/cli/node_modules/metro/src/DeltaBundler/Worker.js:14:24)
    at _next (/home/expo/workingdir/build/node_modules/@react-native-community/cli/node_modules/metro/src/DeltaBundler/Worker.js:36:9)
    at /home/expo/workingdir/build/node_modules/@react-native-community/cli/node_modules/metro/src/DeltaBundler/Worker.js:43:7
    at new Promise (<anonymous>)
    at Object.<anonymous> (/home/expo/workingdir/build/node_modules/@react-native-community/cli/node_modules/metro/src/DeltaBundler/Worker.js:32:12)
    at Object._transform (/home/expo/workingdir/build/node_modules/@react-native-community/cli/node_modules/metro/src/DeltaBundler/Worker.js:98:21)
    at Object.transform (/home/expo/workingdir/build/node_modules/@react-native-community/cli/node_modules/metro/src/DeltaBundler/Worker.js:55:21)
info Run CLI with --verbose flag for more details.
> Task :app:bundleReleaseJsAndAssets FAILED
[stderr] 
FAILURE: Build failed with an exception.
[stderr] 
* What went wrong:
[stderr] 
Execution failed for task ':app:bundleReleaseJsAndAssets'.
[stderr] 
> Process 'command 'node'' finished with non-zero exit value 1
[stderr] 
* Try:
[stderr] 
Run with --stacktrace option to get the stack trace. Run with --info or --debug option to get more log output. Run with --scan to get full insights.
[stderr] 
* Get more help at https://help.gradle.org
[stderr] 
BUILD FAILED in 1m 55s
Deprecated Gradle features were used in this build, making it incompatible with Gradle 7.0.
Use '--warning-mode all' to show the individual deprecation warnings.
See https://docs.gradle.org/6.9/userguide/command_line_interface.html#sec:command_line_warnings
1 actionable task: 1 executed
Error: Gradle build failed with unknown error. Please see logs for the "Run gradlew" phase.